Target
Fatty acid-binding protein, adipocyte
Ligand
BDBM50212873
Substrate
Meas. Tech.
ChEMBL_817178 (CHEMBL2025789)
Ki
29±n/a nM
Citation
 Xu, QHuang, LLiu, JMa, LChen, TChen, JPeng, FCao, DYang, ZQiu, NQiu, JWang, GLiang, XPeng, AXiang, MWei, YChen, L Design, synthesis and biological evaluation of thiazole- and indole-based derivatives for the treatment of type II diabetes. Eur J Med Chem 52:70-81 (2012)  
Target
Name:
Fatty acid-binding protein, adipocyte
Synonyms:
A-FABP ALBP Adipocyte-type fatty acid-binding protein Fabp4 | Fatty acid-binding protein 4
Type:
PROTEIN
Mol. Mass.:
14709.32
Organism:
Rattus norvegicus
Description:
ChEMBL_817178
Residue:
132
  
Inhibitor
Name:
BDBM50212873
Synonyms:
((2'-(5-ETHYL-3,4-DIPHENYL-1H-PYRAZOL-1-YL)-3-BIPHENYLYL)OXY)ACETIC ACID CHEMBL247920 | [2'-(5-Ethyl-3,4-diphenyl-pyrazol-1-yl)-biphenyl-3-yloxy]-acetic acid
Type:
Small organic molecule
Emp. Form.:
C31H26N2O3
Mol. Mass.:
474.5497
SMILES:
CCc1c(c(nn1-c1ccccc1-c1cccc(OCC(O)=O)c1)-c1ccccc1)-c1ccccc1
: