Target
Peroxisome proliferator-activated receptor delta
Ligand
BDBM50199778
Substrate
Meas. Tech.
ChEMBL_822293 (CHEMBL2038596)
IC50
3±n/a nM
Citation
 Méndez-Lucio, OPérez-Villanueva, JCastillo, RMedina-Franco, JL Activity landscape modeling of PPAR ligands with dual-activity difference maps. Bioorg Med Chem 20:3523-32 (2012)  
Target
Name:
Peroxisome proliferator-activated receptor delta
Synonyms:
NR1C2 NUCI Nuclear receptor subfamily 1 group C member 2 PPAR-beta PPARD Peroxisome proliferator-activated receptor Peroxisome proliferator-activated receptor delta
Type:
Enzyme
Mol. Mass.:
49910.45
Organism:
Homo sapiens (Human)
Description:
Q03181
Residue:
441
  
Inhibitor
Name:
BDBM50199778
Synonyms:
3-(4-((R)-3-(4-ethyl-2-(thiazol-4-yl)phenoxy)butoxy)-2-methylphenyl)propanoic acid | CHEMBL241286
Type:
Small organic molecule
Emp. Form.:
C25H29NO4S
Mol. Mass.:
439.567
SMILES:
CCc1ccc(O[C@H](C)CCOc2ccc(CCC(O)=O)c(C)c2)c(c1)-c1cscn1
: