Target
Glycogen synthase kinase-3 beta
Ligand
BDBM50397756
Substrate
Meas. Tech.
ChEMBL_874339 (CHEMBL2182637)
Ki
0.48±n/a nM
Citation
 Berg, SBergh, MHellberg, SHögdin, KLo-Alfredsson, YSöderman, Pvon Berg, SWeigelt, TOrmö, MXue, YTucker, JNeelissen, JJerning, ENilsson, YBhat, R Discovery of novel potent and highly selective glycogen synthase kinase-3ß (GSK3ß) inhibitors for Alzheimer's disease: design, synthesis, and characterization of pyrazines. J Med Chem 55:9107-19 (2012)  
Target
Name:
Glycogen synthase kinase-3 beta
Synonyms:
GSK-3 beta GSK3B Glycogen synthase kinase 3 beta (GSK3B) Glycogen synthase kinase-3 beta (GSK-3B) Glycogen synthase kinase-3 beta (GSK3B) Glycogen synthase kinase-3beta (GSK3B) | Serine/threonine-protein kinase GSK3B
Type:
Enzyme
Mol. Mass.:
46756.38
Organism:
Homo sapiens (Human)
Description:
P49841
Residue:
420
  
Inhibitor
Name:
BDBM50397756
Synonyms:
CHEMBL2177174
Type:
Small organic molecule
Emp. Form.:
C23H27N7O3S
Mol. Mass.:
481.571
SMILES:
CN(C)Cc1ccncc1NC(=O)c1nc(cnc1N)-c1ccc(cc1)S(=O)(=O)N1CCCC1
: