Target
Voltage-dependent N-type calcium channel subunit alpha-1B
Ligand
BDBM5718
Substrate
Meas. Tech.
ChEMBL_880021 (CHEMBL2212933)
EC50
>1000000±n/a nM
Citation
 Liang, MTarr, TBBravo-Altamirano, KValdomir, GRensch, GSwanson, LDeStefino, NRMazzarisi, CMOlszewski, RAWilson, GMMeriney, SDWipf, P Synthesis and biological evaluation of a selective N- and p/q-type calcium channel agonist. ACS Med Chem Lett 3:985-990 (2012)  
Target
Name:
Voltage-dependent N-type calcium channel subunit alpha-1B
Synonyms:
BIII CAC1B_HUMAN CACNA1B Calcium channel (Type N) Voltage-dependent N-type calcium channel subunit alpha-1B Voltage-gated N-type calcium channel alpha-1B subunit Voltage-gated calcium channel Voltage-gated calcium channel subunit alpha Cav2.2 ((alpha 1B, beta 1b, alpha 2 delta-1) | calcium channel, voltage-dependent, N type, alpha 1B subunit
Type:
Enzyme
Mol. Mass.:
262548.16
Organism:
Homo sapiens (Human)
Description:
Q00975
Residue:
2339
  
Inhibitor
Name:
BDBM5718
Synonyms:
2,6,9-Trisubstituted purine deriv. 26 2-{[6-(benzylamino)-9-methyl-9H-purin-2-yl]amino}ethanol CHEMBL280074 purine deriv. 5
Type:
Small organic molecule
Emp. Form.:
C15H18N6O
Mol. Mass.:
298.343
SMILES:
Cn1cnc2c(NCc3ccccc3)nc(NCCO)nc12
: