Target
Voltage-dependent N-type calcium channel subunit alpha-1B
Ligand
BDBM10633
Substrate
Meas. Tech.
ChEMBL_880021 (CHEMBL2212933)
EC50
>1000000±n/a nM
Citation
 Liang, MTarr, TBBravo-Altamirano, KValdomir, GRensch, GSwanson, LDeStefino, NRMazzarisi, CMOlszewski, RAWilson, GMMeriney, SDWipf, P Synthesis and biological evaluation of a selective N- and p/q-type calcium channel agonist. ACS Med Chem Lett 3:985-990 (2012)  
Target
Name:
Voltage-dependent N-type calcium channel subunit alpha-1B
Synonyms:
BIII CAC1B_HUMAN CACNA1B Calcium channel (Type N) Voltage-dependent N-type calcium channel subunit alpha-1B Voltage-gated N-type calcium channel alpha-1B subunit Voltage-gated calcium channel Voltage-gated calcium channel subunit alpha Cav2.2 ((alpha 1B, beta 1b, alpha 2 delta-1) | calcium channel, voltage-dependent, N type, alpha 1B subunit
Type:
Enzyme
Mol. Mass.:
262548.16
Organism:
Homo sapiens (Human)
Description:
Q00975
Residue:
2339
  
Inhibitor
Name:
BDBM10633
Synonyms:
3-{[6-(benzylamino)-9-(propan-2-yl)-9H-purin-2-yl]amino}propan-1-ol 6-(benzylamino)-2-[(3-hydroxypropyl)amino]-9-isopropylpurine purine deriv. 1
Type:
Small organic molecule
Emp. Form.:
C18H24N6O
Mol. Mass.:
340.4228
SMILES:
CC(C)n1cnc2c(NCc3ccccc3)nc(NCCCO)nc12
: