Target
Ribosyldihydronicotinamide dehydrogenase [quinone]
Ligand
BDBM50403047
Substrate
Meas. Tech.
ChEMBL_887589 (CHEMBL2217198)
Ki
900±n/a nM
Citation
 Michaelis, SMarais, ASchrey, AKGraebner, OYSchaudt, CSefkow, MKroll, FDreger, MGlinski, MKoester, HMetternich, RFischer, JJ Dabigatran and dabigatran ethyl ester: potent inhibitors of ribosyldihydronicotinamide dehydrogenase (NQO2). J Med Chem 55:3934-44 (2012)  
Target
Name:
Ribosyldihydronicotinamide dehydrogenase [quinone]
Synonyms:
Metallothionein-3 NQO2 NRH dehydrogenase [quinone] 2 QR2 Quinone reductase 2 (NQO2) | Ribosyldihydronicotinamide dehydrogenase [quinone]
Type:
Protein
Mol. Mass.:
25917.25
Organism:
Homo sapiens (Human)
Description:
P16083
Residue:
231
  
Inhibitor
Name:
BDBM50403047
Synonyms:
CHEMBL1231568
Type:
Small organic molecule
Emp. Form.:
C27H29N7O3
Mol. Mass.:
499.5643
SMILES:
CCOC(=O)CCN(C(=O)c1ccc2n(C)c(CNc3ccc(cc3)C(N)=N)nc2c1)c1ccccn1
: