Target
Beta-1 adrenergic receptor
Ligand
BDBM50404979
Substrate
Meas. Tech.
ChEMBL_39350 (CHEMBL654957)
Kd
11±n/a nM
Citation
 Baldwin, JJDenny, GHHirschmann, RFreedman, MBPonticello, GSGross, DMSweet, CS Beta 1-selective adrenoceptor antagonists: examples of the 2-[4-[3-(substituted-amino)-2-hydroxypropoxy]phenyl]imidazole class. J Med Chem 26:950-7 (1983)  
Target
Name:
Beta-1 adrenergic receptor
Synonyms:
ADRB1 adrenergic Beta1
Type:
Enzyme Catalytic Domain
Mol. Mass.:
50540.48
Organism:
GUINEA PIG
Description:
adrenergic Beta1 ADRB1 GUINEA PIG::B0FL73
Residue:
467
  
Inhibitor
Name:
BDBM50404979
Synonyms:
CHEMBL2096751
Type:
Small organic molecule
Emp. Form.:
C22H27N3O4
Mol. Mass.:
397.4675
SMILES:
COc1ccc(CCNC[C@H](O)COc2ccc(cc2)-c2ncc[nH]2)cc1OC
: