Target
Beta-1 adrenergic receptor
Ligand
BDBM50404994
Substrate
Meas. Tech.
ChEMBL_39350 (CHEMBL654957)
Kd
1.9±n/a nM
Citation
 Baldwin, JJDenny, GHHirschmann, RFreedman, MBPonticello, GSGross, DMSweet, CS Beta 1-selective adrenoceptor antagonists: examples of the 2-[4-[3-(substituted-amino)-2-hydroxypropoxy]phenyl]imidazole class. J Med Chem 26:950-7 (1983)  
Target
Name:
Beta-1 adrenergic receptor
Synonyms:
ADRB1 adrenergic Beta1
Type:
Enzyme Catalytic Domain
Mol. Mass.:
50540.48
Organism:
GUINEA PIG
Description:
adrenergic Beta1 ADRB1 GUINEA PIG::B0FL73
Residue:
467
  
Inhibitor
Name:
BDBM50404994
Synonyms:
CHEMBL2096752
Type:
Small organic molecule
Emp. Form.:
C16H18F3N3O2
Mol. Mass.:
341.3282
SMILES:
O[C@@H](CNC1CC1)COc1ccc(cc1)-c1ncc([nH]1)C(F)(F)F
: