Target
D(1A) dopamine receptor
Ligand
BDBM50040237
Substrate
Meas. Tech.
ChEMBL_60518 (CHEMBL858025)
Ki
14±n/a nM
Citation
 Liégeois, JFRogister, FABruhwyler, JDamas, JNguyen, TPInarejos, MOChleide, EMMercier, MGDelarge, JE Pyridobenzoxazepine and pyridobenzothiazepine derivatives as potential central nervous system agents: synthesis and neurochemical study. J Med Chem 37:519-25 (1994)  
Target
Name:
D(1A) dopamine receptor
Synonyms:
DOPAMINE D1 Dopamine D1 high Dopamine receptor Dopamine1-like Drd1a
Type:
Enzyme Catalytic Domain
Mol. Mass.:
49429.75
Organism:
RAT
Description:
P18901
Residue:
446
  
Inhibitor
Name:
BDBM50040237
Synonyms:
2-Chloro-11-(4-methyl-piperazin-1-yl)-dibenzo[b,f][1,4]thiazepine 2-chloro-11-(4-methylpiperazin-1-yl)dibenzo[b,f][1,4]thiazepine Clothiapine
Type:
Small organic molecule
Emp. Form.:
C18H18ClN3S
Mol. Mass.:
343.874
SMILES:
CN1CCN(CC1)C1=Nc2ccccc2Sc2ccc(Cl)cc12
: