Target
Broad substrate specificity ATP-binding cassette transporter ABCG2
Ligand
BDBM50338982
Substrate
Meas. Tech.
ChEMBL_835940 (CHEMBL2077078)
IC50
>50000±n/a nM
Citation
 Ozvegy-Laczka, CHegedus, TVárady, GUjhelly, OSchuetz, JDVáradi, AKéri, GOrfi, LNémet, KSarkadi, B High-affinity interaction of tyrosine kinase inhibitors with the ABCG2 multidrug transporter. Mol Pharmacol 65:1485-95 (2004)  
Target
Name:
Broad substrate specificity ATP-binding cassette transporter ABCG2
Synonyms:
ABCG2 ABCP ATP-binding cassette sub-family G member 2 ATP-binding cassette, sub-family G, member 2 BCRP1 CDw338 Mitoxantrone resistance-associated protein Urate exporter
Type:
Multi-pass membrane protein; monomer or homodimer; disulfide-linked
Mol. Mass.:
72329.48
Organism:
Homo sapiens (Human)
Description:
Q9UNQ0
Residue:
655
  
Inhibitor
Name:
BDBM50338982
Synonyms:
(R)-5-((3,4-dimethoxyphenethyl)(methyl)amino)-2-(3,4-dimethoxyphenyl)-2-isopropylpentanenitrile (S)-2-(3,4-Dimethoxy-phenyl)-5-{[2-(3,4-dimethoxy-phenyl)-ethyl]-methyl-amino}-2-isopropyl-pentanenitrile; hydrochloride (Verapamil) 2-(3,4-Dimethoxy-phenyl)-5-{[2-(3,4-dimethoxy-phenyl)-ethyl]-methyl-amino}-2-isopropyl-pentanenitrile 2-(3,4-dimethoxy-phenyl)-5-{[2-(3,4-dimethoxy-phenyl)-ethyl]-methyl-amino}-2-isopropyl-pentanenitrile 5-((3,4-dimethoxyphenethyl)(methyl)amino)-2-(3,4-dimethoxyphenyl)-2-isopropylpentanenitrile 5-{[2-(3,4-Dimethoxy-phenyl)-ethyl]-methyl-amino}-2-isopropyl-2-(4-methoxy-phenyl)-pentanenitrile Calan Covera-HS Iproveratril Isoptin SR VERAPAMIL Verapramil verapamil-R
Type:
Small organic molecule
Emp. Form.:
C27H38N2O4
Mol. Mass.:
454.6016
SMILES:
COc1ccc(CCN(C)CCC[C@@](C#N)(C(C)C)c2ccc(OC)c(OC)c2)cc1OC
: