Target
Solute carrier family 22 member 1
Ligand
BDBM35229
Substrate
Meas. Tech.
ChEMBL_838296 (CHEMBL2076244)
Ki
2800±n/a nM
Citation
 Gründemann, DGorboulev, VGambaryan, SVeyhl, MKoepsell, H Drug excretion mediated by a new prototype of polyspecific transporter. Nature 372:549-552 (1994)  
Target
Name:
Solute carrier family 22 member 1
Synonyms:
Adrenaline alpha1 Organic cation transporter 1 Slc22a1 adrenergic Alpha1 | rOCT1
Type:
Enzyme Catalytic Domain
Mol. Mass.:
61538.40
Organism:
RAT
Description:
Adrenaline alpha1 0 RAT::Q63089
Residue:
556
  
Inhibitor
Name:
BDBM35229
Synonyms:
3-(10,11-dihydro-5H-dibenzo[b,f]azepin-5-yl)-N-methylpropan-1-amine CHEMBL72 DMI Desipramine N-(3-methylaminopropyl)iminobibenzyl demethylimipramine norimipramine
Type:
Small organic molecule
Emp. Form.:
C18H22N2
Mol. Mass.:
266.3807
SMILES:
CNCCCN1c2ccccc2CCc2ccccc12
: