Target
D(3) dopamine receptor
Ligand
BDBM50403975
Substrate
Meas. Tech.
ChEBML_62452
IC50
0.549541±n/a nM
Citation
 Andrés, JIAlonso, JMFernández, JIturrino, LMartínez, PMeert, TFSipido, VK 2-(Dimethylaminomethyl)-tetrahydroisoxazolopyridobenzazepine derivatives. Synthesis of a new 5-HT(2C) antagonist with potential anxiolytic properties. Bioorg Med Chem Lett 12:3573-7 (2002)  
Target
Name:
D(3) dopamine receptor
Synonyms:
DOPAMINE D3 DRD3_HUMAN Dopamine D3 receptor (D3) Dopamine receptor Dopamine receptor D3
Type:
Mol. Mass.:
44243.43
Organism:
Homo sapiens (Human)
Description:
Residue:
400
  
Inhibitor
Name:
BDBM50403975
Synonyms:
CHEMBL315772
Type:
Small organic molecule
Emp. Form.:
C19H21ClN2O
Mol. Mass.:
328.836
SMILES:
CN(C)CC1CC2N(O1)c1cc(Cl)ccc1Cc1ccccc21
: