Target
Albumin
Ligand
BDBM50425923
Substrate
Meas. Tech.
ChEMBL_934194 (CHEMBL2319454)
IC50
3900±n/a nM
Citation
 Shantharam, CSSuyoga Vardhan, DMSuhas, RSridhara, MBGowda, DC Inhibition of protein glycation by urea and thiourea derivatives of glycine/proline conjugated benzisoxazole analogue - synthesis and structure-activity studies. Eur J Med Chem 60:325-32 (2013)  
Target
Name:
Albumin
Synonyms:
ALB Serum albumin | serum albumin precursor
Type:
PROTEIN
Mol. Mass.:
69288.15
Organism:
Bos taurus
Description:
ChEMBL_1502598
Residue:
607
  
Inhibitor
Name:
BDBM50425923
Synonyms:
CHEMBL2313709
Type:
Small organic molecule
Emp. Form.:
C25H27FN4O3S
Mol. Mass.:
482.57
SMILES:
COc1ccc(NC(=S)N2CCCC2C(=O)N2CCC(CC2)c2noc3cc(F)ccc23)cc1
: