Target
Albumin
Ligand
BDBM50425946
Substrate
Meas. Tech.
ChEMBL_934194 (CHEMBL2319454)
IC50
4100±n/a nM
Citation
 Shantharam, CSSuyoga Vardhan, DMSuhas, RSridhara, MBGowda, DC Inhibition of protein glycation by urea and thiourea derivatives of glycine/proline conjugated benzisoxazole analogue - synthesis and structure-activity studies. Eur J Med Chem 60:325-32 (2013)  
Target
Name:
Albumin
Synonyms:
ALB Serum albumin | serum albumin precursor
Type:
PROTEIN
Mol. Mass.:
69288.15
Organism:
Bos taurus
Description:
ChEMBL_1502598
Residue:
607
  
Inhibitor
Name:
BDBM50425946
Synonyms:
CHEMBL2313736
Type:
Small organic molecule
Emp. Form.:
C22H23FN4O3S
Mol. Mass.:
442.506
SMILES:
COc1ccccc1NC(=S)NCC(=O)N1CCC(CC1)c1noc2cc(F)ccc12
: