Target
Cell division cycle 7-related protein kinase
Ligand
BDBM50426464
Substrate
Meas. Tech.
ChEMBL_940355 (CHEMBL2328973)
Ki
1.4±n/a nM
Citation
 Tong, YStewart, KDFlorjancic, ASHarlan, JEMerta, PJPrzytulinska, MSoni, NSwinger, KKZhu, HJohnson, EFShoemaker, ARPenning, TD Azaindole-Based Inhibitors of Cdc7 Kinase: Impact of the Pre-DFG Residue, Val 195. ACS Med Chem Lett 4:211-5 (2013)  
Target
Name:
Cell division cycle 7-related protein kinase
Synonyms:
CDC7 CDC7L1 Cell division cycle 7-related protein kinase (CDC7) huCdc7
Type:
Protein
Mol. Mass.:
63908.16
Organism:
Homo sapiens (Human)
Description:
O00311
Residue:
574
  
Inhibitor
Name:
BDBM50426464
Synonyms:
CHEMBL2322674
Type:
Small organic molecule
Emp. Form.:
C20H15N5
Mol. Mass.:
325.3666
SMILES:
N#Cc1cc(cc(NCc2ccccc2)n1)-c1c[nH]c2ncccc12
: