Target
Indoleamine 2,3-dioxygenase 1
Ligand
BDBM50428658
Substrate
Meas. Tech.
ChEMBL_946932 (CHEMBL2346473)
Ki
25000±n/a nM
Citation
 Dolušic, ELarrieu, PMeinguet, CColette, DRives, ABlanc, SFerain, TPilotte, LStroobant, VWouters, JVan den Eynde, BMasereel, BDelfourne, EFrédérick, R Indoleamine 2,3-dioxygenase inhibitory activity of derivatives of marine alkaloid tsitsikammamine A. Bioorg Med Chem Lett 23:47-54 (2012)  
Target
Name:
Indoleamine 2,3-dioxygenase 1
Synonyms:
I23O1_HUMAN IDO-1 INDO Indoleamine 2,3-dioxygenase | Indoleamine-pyrrole 2,3-dioxygenase
Type:
Enzyme
Mol. Mass.:
45330.80
Organism:
Homo sapiens (Human)
Description:
P14902
Residue:
403
  
Inhibitor
Name:
BDBM50428658
Synonyms:
MITOMYCIN Mitosol Mutamycin NSC-26980
Type:
Small organic molecule
Emp. Form.:
C15H18N4O5
Mol. Mass.:
334.3272
SMILES:
CO[C@]12[C@H]3N[C@H]3CN1C1=C([C@H]2COC(N)=O)C(=O)C(N)=C(C)C1=O
: