Target
Nitric oxide synthase, inducible
Ligand
BDBM50328814
Substrate
Meas. Tech.
ChEMBL_946178 (CHEMBL2344057)
Ki
5800±n/a nM
Citation
 Li, HXue, FKraus, JMJi, HLabby, KJMataka, JDelker, SLMartásek, PRoman, LJPoulos, TLSilverman, RB Cyclopropyl- and methyl-containing inhibitors of neuronal nitric oxide synthase. Bioorg Med Chem 21:1333-43 (2013)  
Target
Name:
Nitric oxide synthase, inducible
Synonyms:
Inducible NO synthase Inducible nitric oxide synthase (iNOS) MAC-NOS NOS type II Nitric Oxide Synthase, inducible Nos2
Type:
Enzyme
Mol. Mass.:
130595.79
Organism:
Mus musculus (mouse)
Description:
Recombinant enzyme overexpressed in E. coli.
Residue:
1144
  
Inhibitor
Name:
BDBM50328814
Synonyms:
(+/-)-6-((4-(2-(3-fluorophenethylamino)ethoxy)pyrrolidin-3-yl)methyl)-4-methylpyridin-2-amine 6-{[(3R,4R)-4-(2-{[2-(3-fluorophenyl)ethyl]amino}ethoxy)pyrrolidin-3-yl]methyl}-4-methylpyridin-2-amine CHEMBL1278132 US9212144, 2
Type:
Small organic molecule
Emp. Form.:
C21H29FN4O
Mol. Mass.:
372.4796
SMILES:
Cc1cc(N)nc(C[C@@H]2CNC[C@@H]2OCCNCCc2cccc(F)c2)c1
: