Target
Nitric oxide synthase, inducible
Ligand
BDBM50429230
Substrate
Meas. Tech.
ChEMBL_946178 (CHEMBL2344057)
Ki
10000±n/a nM
Citation
 Li, HXue, FKraus, JMJi, HLabby, KJMataka, JDelker, SLMartásek, PRoman, LJPoulos, TLSilverman, RB Cyclopropyl- and methyl-containing inhibitors of neuronal nitric oxide synthase. Bioorg Med Chem 21:1333-43 (2013)  
Target
Name:
Nitric oxide synthase, inducible
Synonyms:
Inducible NO synthase Inducible nitric oxide synthase (iNOS) MAC-NOS NOS type II Nitric Oxide Synthase, inducible Nos2
Type:
Enzyme
Mol. Mass.:
130595.79
Organism:
Mus musculus (mouse)
Description:
Recombinant enzyme overexpressed in E. coli.
Residue:
1144
  
Inhibitor
Name:
BDBM50429230
Synonyms:
CHEMBL2332791
Type:
Small organic molecule
Emp. Form.:
C22H29ClN4O
Mol. Mass.:
400.945
SMILES:
Cc1cc(N)nc(C[C@@H]2CNC[C@@H]2OCCNC2CC2c2cccc(Cl)c2)c1
: