Target
Nitric oxide synthase, brain
Ligand
BDBM50429230
Substrate
Meas. Tech.
ChEMBL_946181 (CHEMBL2344060)
Ki
140±n/a nM
Citation
 Li, HXue, FKraus, JMJi, HLabby, KJMataka, JDelker, SLMartásek, PRoman, LJPoulos, TLSilverman, RB Cyclopropyl- and methyl-containing inhibitors of neuronal nitric oxide synthase. Bioorg Med Chem 21:1333-43 (2013)  
Target
Name:
Nitric oxide synthase, brain
Synonyms:
Bnos NC-NOS NOS type I nNOS Neuronal nitric oxide synthase Nitric Oxide Synthase, brain Nitric oxide synthase, brain (nNOS) Nitric-oxide synthase, brain (nNOS) Nos1 | Peptidyl-cysteine S-nitrosylase NOS1
Type:
Enzyme
Mol. Mass.:
160570.98
Organism:
Rattus norvegicus (rat)
Description:
Recombinant nNOS overexpressed in E. coli was used in enzyme assays.
Residue:
1429
  
Inhibitor
Name:
BDBM50429230
Synonyms:
CHEMBL2332791
Type:
Small organic molecule
Emp. Form.:
C22H29ClN4O
Mol. Mass.:
400.945
SMILES:
Cc1cc(N)nc(C[C@@H]2CNC[C@@H]2OCCNC2CC2c2cccc(Cl)c2)c1
: