Target
Neuronal acetylcholine receptor subunit alpha-4/beta-2
Ligand
BDBM50433569
Substrate
Meas. Tech.
ChEMBL_959891 (CHEMBL2383617)
Ki
11±n/a nM
Citation
 Faundez-Parraguez, MFarias-Rabelo, NGonzalez-Gutierrez, JPEtcheverry-Berrios, AAlzate-Morales, JAdasme-Carreño, FVaras, RBermudez, IIturriaga-Vasquez, P Neonicotinic analogues: selective antagonists fora4ß2 nicotinic acetylcholine receptors. Bioorg Med Chem 21:2687-94 (2013)  
Target
Name:
Neuronal acetylcholine receptor subunit alpha-4/beta-2
Synonyms:
Neuronal acetylcholine receptor Alpha-4/Beta-2 Neuronal acetylcholine receptor; alpha4/beta2 | nAChR subtypes alpha4 beta2
Type:
Protein
Mol. Mass.:
Description:
Components:
This complex has 2 components.
Component 1
Name:
Neuronal acetylcholine receptor subunit alpha-4
Synonyms:
ACHA4_HUMAN CHRNA4 protein Neuronal acetylcholine receptor protein alpha-4 subunit Nicotinic acetylcholine receptor alpha4/beta2/alpha5
Type:
Mol. Mass.:
69963.49
Organism:
Homo sapiens (Human)
Description:
NACHRA4
Residue:
627
  
Component 2
Name:
Neuronal acetylcholine receptor subunit beta-2
Synonyms:
ACHB2_HUMAN Neuronal acetylcholine receptor protein beta-2 subunit | Nicotinic acetylcholine receptor alpha3/beta2/alpha5
Type:
Protein
Mol. Mass.:
57020.50
Organism:
Homo sapiens (Human)
Description:
P17787
Residue:
502
  
Inhibitor
Name:
BDBM50433569
Synonyms:
CHEMBL2381563
Type:
Small organic molecule
Emp. Form.:
C13H16ClNO2
Mol. Mass.:
253.725
SMILES:
CN1CCC[C@H]1COC(=O)c1ccc(Cl)cc1
: