Target
Neuronal acetylcholine receptor subunit alpha-4/alpha-5/beta-2
Ligand
BDBM50433572
Substrate
Meas. Tech.
ChEMBL_959889 (CHEMBL2383615)
IC50
52300±n/a nM
Citation
 Faundez-Parraguez, MFarias-Rabelo, NGonzalez-Gutierrez, JPEtcheverry-Berrios, AAlzate-Morales, JAdasme-Carreño, FVaras, RBermudez, IIturriaga-Vasquez, P Neonicotinic analogues: selective antagonists fora4ß2 nicotinic acetylcholine receptors. Bioorg Med Chem 21:2687-94 (2013)  
Target
Name:
Neuronal acetylcholine receptor subunit alpha-4/alpha-5/beta-2
Synonyms:
Nicotinic acetylcholine receptor alpha4/beta2/alpha5
Type:
Mol. Mass.:
Description:
ASSAY_ID of ChEMBL is 959889
Components:
This complex has 3 components.
Component 1
Name:
Neuronal acetylcholine receptor subunit alpha-4
Synonyms:
ACHA4_HUMAN CHRNA4 protein Neuronal acetylcholine receptor protein alpha-4 subunit Nicotinic acetylcholine receptor alpha4/beta2/alpha5
Type:
Mol. Mass.:
69963.49
Organism:
Homo sapiens (Human)
Description:
NACHRA4
Residue:
627
  
Component 2
Name:
Neuronal acetylcholine receptor subunit beta-2
Synonyms:
ACHB2_HUMAN Neuronal acetylcholine receptor protein beta-2 subunit | Nicotinic acetylcholine receptor alpha3/beta2/alpha5
Type:
Protein
Mol. Mass.:
57020.50
Organism:
Homo sapiens (Human)
Description:
P17787
Residue:
502
  
Component 3
Name:
Neuronal acetylcholine receptor subunit alpha-5
Synonyms:
ACHA5_HUMAN NACHRA5 Neuronal acetylcholine receptor subunit alpha-5
Type:
PROTEIN
Mol. Mass.:
53056.36
Organism:
Homo sapiens (Human)
Description:
EBI_10671
Residue:
468
  
Inhibitor
Name:
BDBM50433572
Synonyms:
CHEMBL2381568
Type:
Small organic molecule
Emp. Form.:
C13H17NO2
Mol. Mass.:
219.2796
SMILES:
CN1CCC[C@H]1COC(=O)c1ccccc1
: