Target
Neuronal acetylcholine receptor subunit alpha-7
Ligand
BDBM50433569
Substrate
Meas. Tech.
ChEMBL_959892 (CHEMBL2383618)
IC50
8900±n/a nM
Citation
 Faundez-Parraguez, MFarias-Rabelo, NGonzalez-Gutierrez, JPEtcheverry-Berrios, AAlzate-Morales, JAdasme-Carreño, FVaras, RBermudez, IIturriaga-Vasquez, P Neonicotinic analogues: selective antagonists fora4ß2 nicotinic acetylcholine receptors. Bioorg Med Chem 21:2687-94 (2013)  
Target
Name:
Neuronal acetylcholine receptor subunit alpha-7
Synonyms:
ACHA7_HUMAN Cholinergic, Nicotinic Alpha7 Neuronal acetylcholine receptor protein alpha-7 subunit Nicotinic acetylcholine receptor alpha-7 (alpha7 nAChR)
Type:
Mol. Mass.:
56448.33
Organism:
Homo sapiens (Human)
Description:
CHRNA7 (NACHRA7)
Residue:
502
  
Inhibitor
Name:
BDBM50433569
Synonyms:
CHEMBL2381563
Type:
Small organic molecule
Emp. Form.:
C13H16ClNO2
Mol. Mass.:
253.725
SMILES:
CN1CCC[C@H]1COC(=O)c1ccc(Cl)cc1
: