Target
Neuronal acetylcholine receptor subunit alpha-7
Ligand
BDBM82070
Substrate
Meas. Tech.
ChEMBL_959892 (CHEMBL2383618)
IC50
7600±n/a nM
Citation
 Faundez-Parraguez, MFarias-Rabelo, NGonzalez-Gutierrez, JPEtcheverry-Berrios, AAlzate-Morales, JAdasme-Carreño, FVaras, RBermudez, IIturriaga-Vasquez, P Neonicotinic analogues: selective antagonists fora4ß2 nicotinic acetylcholine receptors. Bioorg Med Chem 21:2687-94 (2013)  
Target
Name:
Neuronal acetylcholine receptor subunit alpha-7
Synonyms:
ACHA7_HUMAN Cholinergic, Nicotinic Alpha7 Neuronal acetylcholine receptor protein alpha-7 subunit Nicotinic acetylcholine receptor alpha-7 (alpha7 nAChR)
Type:
Mol. Mass.:
56448.33
Organism:
Homo sapiens (Human)
Description:
CHRNA7 (NACHRA7)
Residue:
502
  
Inhibitor
Name:
BDBM82070
Synonyms:
CAS_29790-52-1 Nicotine-D salicylate US9303017, Nicotine
Type:
Emp. Form.:
C10H14N2
Mol. Mass.:
162.2316
SMILES:
CN1CCC[C@H]1c1cccnc1
: