Target
Poly [ADP-ribose] polymerase 1
Ligand
BDBM50434155
Substrate
Meas. Tech.
ChEMBL_959447 (CHEMBL2384485)
IC50
>85000±n/a nM
Citation
 Bregman, HChakka, NGuzman-Perez, AGunaydin, HGu, YHuang, XBerry, VLiu, JTeffera, YHuang, LEgge, BMullady, ELSchneider, SAndrews, PSMishra, ANewcomb, JSerafino, RStrathdee, CATurci, SMWilson, CDiMauro, EF Discovery of novel, induced-pocket binding oxazolidinones as potent, selective, and orally bioavailable tankyrase inhibitors. J Med Chem 56:4320-42 (2013)  
Target
Name:
Poly [ADP-ribose] polymerase 1
Synonyms:
(ARTD1 or PARP1) 2.4.2.30 ADPRT ARTD1 Human diphtheria toxin-like ADP-ribosyltransferase (ARTD1 or PARP1) NT-PARP-1 PARP1 PPOL Poly [ADP-ribose] polymerase 1 (PARP) Poly [ADP-ribose] polymerase 1 (PARP1) Poly [ADP-ribose] polymerase 1, 28-kDa form Poly [ADP-ribose] polymerase 1, processed C-terminus Poly [ADP-ribose] polymerase-1 Poly(ADP-ribose) polymerase-1 (ARTD1/PARP1) Protein poly-ADP-ribosyltransferase PARP1 | Synonyms=ADPRT
Type:
Mol. Mass.:
113114.22
Organism:
Homo sapiens (Human)
Description:
P09874
Residue:
1014
  
Inhibitor
Name:
BDBM50434155
Synonyms:
CHEMBL2381946 | US9340549, 60
Type:
Small organic molecule
Emp. Form.:
C25H25FN4O3
Mol. Mass.:
448.4894
SMILES:
CC1(C)OC(=O)N([C@H]1c1ccccc1)[C@H]1CC[C@@H](CC1)n1c2ccc(C#N)c(F)c2[nH]c1=O
: