Target
Mitogen-activated protein kinase kinase kinase kinase 2
Ligand
BDBM50436478
Substrate
Meas. Tech.
ChEMBL_966452 (CHEMBL2399040)
IC50
9700±n/a nM
Citation
 Décor, AGrand-Maître, CHucke, OO'Meara, JKuhn, CConstantineau-Forget, LBrochu, CMalenfant, EBertrand-Laperle, MBordeleau, JGhiro, EPesant, MFazal, GGorys, VLittle, MBoucher, CBordeleau, STurcotte, PGuo, TGarneau, MSpickler, CGauthier, A Design, synthesis and biological evaluation of novel aminothiazoles as antiviral compounds acting against human rhinovirus. Bioorg Med Chem Lett 23:3841-7 (2013)  
Target
Name:
Mitogen-activated protein kinase kinase kinase kinase 2
Synonyms:
2.7.11.1 GC kinase Germinal center kinase MAP4K2 MEK kinase kinase 2 RAB8IP | Rab8-interacting protein
Type:
Mol. Mass.:
91551.35
Organism:
Homo sapiens (Human)
Description:
Residue:
820
  
Inhibitor
Name:
BDBM50436478
Synonyms:
CHEMBL2397314
Type:
Small organic molecule
Emp. Form.:
C14H15F3N4OS
Mol. Mass.:
344.355
SMILES:
C[C@H](CC(F)(F)F)C(=O)Nc1nc(C)c(s1)-c1ccc(N)nc1
: