Target
Coagulation factor X
Ligand
BDBM50443857
Substrate
Meas. Tech.
ChEMBL_1277819 (CHEMBL3097585)
IC50
0.200000±n/a nM
Citation
 Meneyrol, JFollmann, MLassalle, GWehner, VBarre, GRousseaux, TAltenburger, JMPetit, FBocskei, ZSchreuder, HAlet, NHerault, JPMillet, LDol, FFlorian, PSchaeffer, PSadoun, FKlieber, SBriot, CBono, FHerbert, JM 5-Chlorothiophene-2-carboxylic acid [(S)-2-[2-methyl-3-(2-oxopyrrolidin-1-yl)benzenesulfonylamino]-3-(4-methylpiperazin-1-yl)-3-oxopropyl]amide (SAR107375), a selective and potent orally active dual thrombin and factor Xa inhibitor. J Med Chem 56:9441-56 (2014)  
Target
Name:
Coagulation factor X
Synonyms:
Activated coagulation factor X (FXa) Coagulation factor X precursor F10 Factor X heavy chain Factor Xa Stuart-Prower factor
Type:
Enzyme
Mol. Mass.:
54726.60
Organism:
Homo sapiens (Human)
Description:
Residue:
488
  
Inhibitor
Name:
BDBM50443857
Synonyms:
CHEMBL3091501
Type:
Small organic molecule
Emp. Form.:
C26H32ClF2N5O6S2
Mol. Mass.:
648.142
SMILES:
CN(C)[C@H]1CCN(C1)C(=O)[C@H](CNC(=O)c1ccc(Cl)s1)NS(=O)(=O)c1cccc(N2CCCCC2=O)c1OC(F)F
: