Target
Delta-type opioid receptor
Ligand
BDBM71613
Substrate
Meas. Tech.
ChEMBL_1352796 (CHEMBL3268196)
IC50
>32000±n/a nM
Citation
 Urbano, MGuerrero, MRosen, HRoberts, E Antagonists of the kappa opioid receptor. Bioorg Med Chem Lett 24:2021-32 (2014)  
Target
Name:
Delta-type opioid receptor
Synonyms:
D-OR-1 Delta opioid receptor OPIATE Delta OPRD1 OPRK1 | opioid receptor, delta 1
Type:
G Protein-Coupled Receptor (GPCR)
Mol. Mass.:
40382.98
Organism:
Homo sapiens (Human)
Description:
Competition binding assays were carried out using membrane preparations from transfected HN9.10 cells that constitutively expressed the delta opioid receptor.
Residue:
372
  
Inhibitor
Name:
BDBM71613
Synonyms:
KSC-1-265 cid_44665679
Type:
Small organic molecule
Emp. Form.:
C28H34N6O4
Mol. Mass.:
518.6074
SMILES:
COc1ccc(N2CCN(CCCNC(=O)Cn3c4nccc(C)c4n4cccc4c3=O)CC2)c(OC)c1
: