Target
Adenosylhomocysteinase
Ligand
BDBM50006215
Substrate
Meas. Tech.
ChEMBL_1362082 (CHEMBL3294635)
IC50
4125±n/a nM
Citation
 Converso, AHartingh, TFraley, MEGarbaccio, RMHartman, GDHuang, SYMajercak, JMMcCampbell, ANa, SJRay, WJSavage, MJWolffe, CYeh, SYu, YWhite, RZhang, R Adenosine analogue inhibitors of S-adenosylhomocysteine hydrolase. Bioorg Med Chem Lett 24:2737-40 (2014)  
Target
Name:
Adenosylhomocysteinase
Synonyms:
AHCY SAHH | SAHH_HUMAN
Type:
PROTEIN
Mol. Mass.:
47714.06
Organism:
Homo sapiens (Human)
Description:
ChEMBL_1507791
Residue:
432
  
Inhibitor
Name:
BDBM50006215
Synonyms:
(1'R,2'S,3'R)-9-(2',3'-dihydroxycyclopent-4'-enyl)adenine 5-(6-Amino-purin-9-yl)-cyclopent-3-ene-1,2-diol | CHEMBL299961
Type:
Small organic molecule
Emp. Form.:
C10H11N5O2
Mol. Mass.:
233.2266
SMILES:
Nc1ncnc2n(cnc12)[C@@H]1C=C[C@@H](O)[C@H]1O
: