Target
Glycylpeptide N-tetradecanoyltransferase 1
Ligand
BDBM50033482
Substrate
Meas. Tech.
ChEMBL_1435039 (CHEMBL3387685)
IC50
5.0±n/a nM
Citation
 Brand, SNorcross, NRThompson, SHarrison, JRSmith, VCRobinson, DATorrie, LSMcElroy, SPHallyburton, INorval, SScullion, PStojanovski, LSimeons, FRvan Aalten, DFrearson, JABrenk, RFairlamb, AHFerguson, MAWyatt, PGGilbert, IHRead, KD Lead optimization of a pyrazole sulfonamide series of Trypanosoma brucei N-myristoyltransferase inhibitors: identification and evaluation of CNS penetrant compounds as potential treatments for stage 2 human African trypanosomiasis. J Med Chem 57:9855-69 (2014)  
Target
Name:
Glycylpeptide N-tetradecanoyltransferase 1
Synonyms:
Myristoyl-CoA:protein N-myristoyltransferase (Nmt) NMT NMT1_HUMAN Peptide N-myristoyltransferase 1
Type:
Enzyme
Mol. Mass.:
56814.10
Organism:
Homo sapiens (Human)
Description:
P30419
Residue:
496
  
Inhibitor
Name:
BDBM50033482
Synonyms:
CHEMBL3357699
Type:
Small organic molecule
Emp. Form.:
C21H30Cl2N4O2S
Mol. Mass.:
473.46
SMILES:
Cc1nn(C)c(C)c1NS(=O)(=O)c1c(Cl)cc(CCCCC2CCNCC2)cc1Cl
: