Target
Potassium voltage-gated channel subfamily H member 2
Ligand
BDBM50044633
Substrate
Meas. Tech.
ChEMBL_1447392 (CHEMBL3380409)
IC50
190±n/a nM
Citation
 Takai, KInoue, YKonishi, YSuwa, AUruno, YMatsuda, HNakako, TSakai, MNishikawa, HHashimoto, GEnomoto, TKitamura, AUematsu, YKiyoshi, ASumiyoshi, T Discovery of N-substituted 7-azaindoline derivatives as potent, orally available M1 and M4 muscarinic acetylcholine receptors selective agonists. Bioorg Med Chem Lett 24:3189-93 (2014)  
Target
Name:
Potassium voltage-gated channel subfamily H member 2
Synonyms:
1,3-beta-glucan synthase component GLS2 ERG Eag-related protein 1 Ether-a-go-go-related gene (HERG) Ether-a-go-go-related gene potassium channel 1 Ether-a-go-go-related gene potassium channel 1 (hERG1) Ether-a-go-go-related protein 1 H-ERG KCNH2 Potassium voltage-gated channel subfamily H member 2 (hERG) Voltage-gated potassium channel subunit Kv11.1 hERG Potassium Channel 1 | putative potassium channel subunit
Type:
Multi-pass membrane protein
Mol. Mass.:
126672.65
Organism:
Homo sapiens (Human)
Description:
Q12809
Residue:
1159
  
Inhibitor
Name:
BDBM50044633
Synonyms:
CHEMBL3310801
Type:
Small organic molecule
Emp. Form.:
C21H31N5O3
Mol. Mass.:
401.5025
SMILES:
CCOC(=O)N1CCC(CN2CCC3(CN(C(N)=O)c4ncccc34)CC2)CC1
: