Target
NAD-dependent protein deacetylase sirtuin-1
Ligand
BDBM27507
Substrate
Meas. Tech.
ChEMBL_1467914 (CHEMBL3413118)
IC50
149000±n/a nM
Citation
 Yang, TChen, XJin, HXSethi, GGo, ML Functionalized tetrahydro-1H-pyrido[4,3-b]indoles: a novel chemotype with Sirtuin 2 inhibitory activity. Eur J Med Chem 92:145-55 (2015)  
Target
Name:
NAD-dependent protein deacetylase sirtuin-1
Synonyms:
NAD-Dependent Deacetylase Sirtuin-1 NAD-dependent protein deacetylase sirtuin-1 (SIRT1) SIR2-like protein 1 SIRT1 Sirtuin-1 (SIRT1) | hSIR2
Type:
Developmental protein; hydrolase
Mol. Mass.:
81626.66
Organism:
Homo sapiens (Human)
Description:
Residue:
747
  
Inhibitor
Name:
BDBM27507
Synonyms:
3-Pyridinecarboxamide NAM nicotinamide | pyridine-3-carboxamide
Type:
Emp. Form.:
C6H6N2O
Mol. Mass.:
122.1246
SMILES:
NC(=O)c1cccnc1
: