Target
Neurogenic locus notch homolog protein 1
Ligand
BDBM50074694
Substrate
Meas. Tech.
ChEMBL_1468307 (CHEMBL3412050)
IC50
4.0±n/a nM
Citation
 Shan, WBalog, AQuesnelle, CGill, PHan, WCNorris, DMandal, SThiruvenkadam, RGona, KBThiyagarajan, KKandula, SMcGlinchey, KMenard, KWen, MLRose, AWhite, RGuarino, VShen, DRCvijic, MERanasinghe, ADai, JZhang, YWu, DRMathur, ARampulla, RTrainor, GHunt, JTVite, GDWesthouse, RLee, FYGavai, AV BMS-871: a novel orally active pan-Notch inhibitor as an anticancer agent. Bioorg Med Chem Lett 25:1905-9 (2015)  
Target
Name:
Neurogenic locus notch homolog protein 1
Synonyms:
NEXT NOTC1_HUMAN Neurogenic locus notch homolog protein 1 Notch 1 Notch 1 intracellular domain TAN1 hN1
Type:
Enzyme
Mol. Mass.:
272417.95
Organism:
Homo sapiens (Human)
Description:
P46531
Residue:
2555
  
Inhibitor
Name:
BDBM50074694
Synonyms:
CHEMBL3410161
Type:
Small organic molecule
Emp. Form.:
C29H27F3N4O3
Mol. Mass.:
536.5449
SMILES:
CN1c2ccccc2C(=N[C@H](NC(=O)[C@H](CCC(F)(F)F)[C@@H](C(N)=O)c2ccccc2)C1=O)c1ccccc1
: