Target
Sodium channel protein type 5 subunit alpha
Ligand
BDBM50017723
Substrate
Meas. Tech.
ChEMBL_1478687 (CHEMBL3430588)
IC50
2520±n/a nM
Citation
 Mirams, GRCui, YSher, AFink, MCooper, JHeath, BMMcMahon, NCGavaghan, DJNoble, D Simulation of multiple ion channel block provides improved early prediction of compounds' clinical torsadogenic risk. Cardiovasc Res 91:53-61 (2011)  
Target
Name:
Sodium channel protein type 5 subunit alpha
Synonyms:
HH1 SCN5A_HUMAN Sodium channel protein type 5 subunit alpha/beta-1/beta-2 Voltage-gated sodium channel subunit alpha Nav1.5
Type:
Enzyme
Mol. Mass.:
226908.60
Organism:
Homo sapiens (Human)
Description:
Q14524
Residue:
2016
  
Inhibitor
Name:
BDBM50017723
Synonyms:
(3,3-Diphenyl-propyl)-(1-methyl-2-phenyl-ethyl)-amine Prenylamine | Prenylamine(3,3-Diphenyl-propyl)-(1-methyl-2-phenyl-ethyl)-amine
Type:
Small organic molecule
Emp. Form.:
C24H27N
Mol. Mass.:
329.4779
SMILES:
CC(Cc1ccccc1)NCCC(c1ccccc1)c1ccccc1
: