Target
Serine/threonine-protein kinase Chk1
Ligand
BDBM50091309
Substrate
Meas. Tech.
ChEMBL_1500169 (CHEMBL3584718)
EC50
51±n/a nM
Citation
 Gazzard, LWilliams, KChen, HAxford, LBlackwood, EBurton, BChapman, KCrackett, PDrobnick, JEllwood, CEpler, JFlagella, MGancia, EGill, MGoodacre, SHalladay, JHewitt, JHunt, HKintz, SLyssikatos, JMacleod, CMajor, SMédard, GNarukulla, RRamiscal, JSchmidt, SSeward, EWiesmann, CWu, PYee, SYen, IMalek, S Mitigation of Acetylcholine Esterase Activity in the 1,7-Diazacarbazole Series of Inhibitors of Checkpoint Kinase 1. J Med Chem 58:5053-74 (2015)  
Target
Name:
Serine/threonine-protein kinase Chk1
Synonyms:
CHEK1 CHK1 checkpoint homolog Checkpoint kinase-1 (CHK1)
Type:
Enzyme Catalytic Domain
Mol. Mass.:
54443.02
Organism:
Homo sapiens (Human)
Description:
gi_166295192
Residue:
476
  
Inhibitor
Name:
BDBM50091309
Synonyms:
CHEMBL3582216
Type:
Small organic molecule
Emp. Form.:
C20H17N5S
Mol. Mass.:
359.447
SMILES:
CCN1CCc2sc(cc2C1)-c1cnc2[nH]c3cnc(cc3c2c1)C#N
: