Target
Poly [ADP-ribose] polymerase 1
Ligand
BDBM27507
Substrate
Meas. Tech.
ChEMBL_1517675 (CHEMBL3619957)
IC50
210000±n/a nM
Citation
 Xie, ZZhou, YZhao, WJiao, HChen, YYang, YLi, Z Identification of novel PARP-1 inhibitors: Drug design, synthesis and biological evaluation. Bioorg Med Chem Lett 25:4557-61 (2015)  
Target
Name:
Poly [ADP-ribose] polymerase 1
Synonyms:
(ARTD1 or PARP1) 2.4.2.30 ADPRT ARTD1 Human diphtheria toxin-like ADP-ribosyltransferase (ARTD1 or PARP1) NT-PARP-1 PARP1 PPOL Poly [ADP-ribose] polymerase 1 (PARP) Poly [ADP-ribose] polymerase 1 (PARP1) Poly [ADP-ribose] polymerase 1, 28-kDa form Poly [ADP-ribose] polymerase 1, processed C-terminus Poly [ADP-ribose] polymerase-1 Poly(ADP-ribose) polymerase-1 (ARTD1/PARP1) Protein poly-ADP-ribosyltransferase PARP1 | Synonyms=ADPRT
Type:
Mol. Mass.:
113114.22
Organism:
Homo sapiens (Human)
Description:
P09874
Residue:
1014
  
Inhibitor
Name:
BDBM27507
Synonyms:
3-Pyridinecarboxamide NAM nicotinamide | pyridine-3-carboxamide
Type:
Emp. Form.:
C6H6N2O
Mol. Mass.:
122.1246
SMILES:
NC(=O)c1cccnc1
: