Target
Histone deacetylase 5
Ligand
BDBM50143215
Substrate
Meas. Tech.
ChEMBL_1553007 (CHEMBL3760291)
IC50
354±n/a nM
Citation
 Kachhadia, VRajagopal, SPonpandian, TVignesh, RAnandhan, KPrabhu, DRajendran, PNidhyanandan, SRoy, AMAhamed, FASurendran, NRajagopal, SNarayanan, SGopalan, B Orally available stilbene derivatives as potent HDAC inhibitors with antiproliferative activities and antitumor effects in human tumor xenografts. Eur J Med Chem 108:274-86 (2016)  
Target
Name:
Histone deacetylase 5
Synonyms:
Antigen NY-CO-9 HDAC5 Histone acetylase 5 (HDAC5) Human HDAC5 | KIAA0600
Type:
Enzyme
Mol. Mass.:
121968.61
Organism:
Homo sapiens (Human)
Description:
Q9UQL6
Residue:
1122
  
Inhibitor
Name:
BDBM50143215
Synonyms:
CHEMBL3758457
Type:
Small organic molecule
Emp. Form.:
C21H21FN2O2
Mol. Mass.:
352.402
SMILES:
ONC(=O)\C=C\c1ccc(\C=C(\CNC2CC2)c2ccc(F)cc2)cc1
: