Target
Histone acetyltransferase p300
Ligand
BDBM50255529
Substrate
Meas. Tech.
ChEMBL_1561265 (CHEMBL3778085)
IC50
3.2±n/a nM
Citation
 Simon, RPRobaa, DAlhalabi, ZSippl, WJung, M KATching-Up on Small Molecule Modulators of Lysine Acetyltransferases. J Med Chem 59:1249-70 (2016)  
Target
Name:
Histone acetyltransferase p300
Synonyms:
EP300 HIF1A/p300/CREB-binding protein P300
Type:
Protein
Mol. Mass.:
264223.04
Organism:
Homo sapiens (Human)
Description:
Q09472
Residue:
2414
  
Inhibitor
Name:
BDBM50255529
Synonyms:
Ac-Lys(CoA)-NH2 | CHEMBL505121
Type:
Small organic molecule
Emp. Form.:
C31H53N10O19P3S
Mol. Mass.:
994.794
SMILES:
CC(=O)N[C@@H](CCCCNC(=O)CSCCNC(=O)CCNC(=O)[C@H](O)C(C)(C)COP(O)(=O)OP(O)(=O)OC[C@H]1O[C@H]([C@H](O)[C@@H]1OP(O)(O)=O)n1cnc2c(N)ncnc12)C(N)=O
: