Target
Prostaglandin G/H synthase 1
Ligand
BDBM28700
Substrate
Meas. Tech.
ChEMBL_1584966 (CHEMBL3819990)
IC50
950000±n/a nM
Citation
 Ehrt, CBrinkjost, TKoch, O Impact of Binding Site Comparisons on Medicinal Chemistry and Rational Molecular Design. J Med Chem 59:4121-51 (2016)  
Target
Name:
Prostaglandin G/H synthase 1
Synonyms:
COX-1 Cyclooxygenase Cyclooxygenase-1 (COX-1) PTGS1 | Prostaglandin G/H synthase (cyclooxygenase)
Type:
Enzyme
Mol. Mass.:
68692.62
Organism:
Homo sapiens (Human)
Description:
P23219
Residue:
599
  
Inhibitor
Name:
BDBM28700
Synonyms:
2-(4-(4-Chlorobenzoyl)phenoxy)-2-methylpropionic acid CHEMBL981 FIBRICOR LF 153 procetofenic acid
Type:
Small organic molecule
Emp. Form.:
C17H15ClO4
Mol. Mass.:
318.752
SMILES:
CC(C)(Oc1ccc(cc1)C(=O)c1ccc(Cl)cc1)C(O)=O
: