Target
N-lysine methyltransferase SMYD2
Ligand
BDBM50075102
Substrate
Meas. Tech.
ChEMBL_1585282 (CHEMBL3821545)
IC50
600±n/a nM
Citation
 Eggert, EHillig, RCKoehr, SStöckigt, DWeiske, JBarak, NMowat, JBrumby, TChrist, CDTer Laak, ALang, TFernandez-Montalvan, AEBadock, VWeinmann, HHartung, IVBarsyte-Lovejoy, DSzewczyk, MKennedy, SLi, FVedadi, MBrown, PJSanthakumar, VArrowsmith, CHStellfeld, TStresemann, C Discovery and Characterization of a Highly Potent and Selective Aminopyrazoline-Based in Vivo Probe (BAY-598) for the Protein Lysine Methyltransferase SMYD2. J Med Chem 59:4578-600 (2016)  
Target
Name:
N-lysine methyltransferase SMYD2
Synonyms:
HSKM-B KMT3C N-lysine methyltransferase SMYD2 SET and MYND domain-containing protein 2 (SMYD2) SMYD2_HUMAN
Type:
Enzyme
Mol. Mass.:
49689.57
Organism:
Homo sapiens (Human)
Description:
Q9NRG4
Residue:
433
  
Inhibitor
Name:
BDBM50075102
Synonyms:
CHEMBL3414623
Type:
Small organic molecule
Emp. Form.:
C36H42N6O
Mol. Mass.:
574.7583
SMILES:
Cc1cn(CCN2CCN(CC2)c2ccccc2-c2cc(cc(c2)C(=O)NCCCN2CCCC2)C#N)c2ccccc12
: