Target
Oxysterols receptor LXR-alpha
Ligand
BDBM50192762
Substrate
Meas. Tech.
ChEMBL_1613605 (CHEMBL3855405)
Ki
20±n/a nM
Citation
 Tice, CMNoto, PBFan, KYZhao, WLotesta, SDDong, CMarcus, APZheng, YJChen, GWu, ZVan Orden, RZhou, JBukhtiyarov, YZhao, YLipinski, KHoward, LGuo, JKandpal, GMeng, SHardy, AKrosky, PGregg, RELeftheris, KMcKeever, BMSingh, SBLala, DMcGeehan, GMZhuang, LClaremon, DA Brain penetrant liver X receptor (LXR) modulators based on a 2,4,5,6-tetrahydropyrrolo[3,4-c]pyrazole core. Bioorg Med Chem Lett 26:5044-5050 (2016)  
Target
Name:
Oxysterols receptor LXR-alpha
Synonyms:
LXRA Liver X receptor alpha Liver X receptor alpha (NR1H3) NR1H3 Nuclear orphan receptor LXR-alpha | Nuclear receptor subfamily 1 group H member 3
Type:
Enzyme Catalytic Domain
Mol. Mass.:
50403.85
Organism:
Homo sapiens (Human)
Description:
Q13133
Residue:
447
  
Inhibitor
Name:
BDBM50192762
Synonyms:
CHEMBL3959681
Type:
Small organic molecule
Emp. Form.:
C20H20F3N5O2S
Mol. Mass.:
451.465
SMILES:
CC(C)[C@H]1N(Cc2cn(nc12)-c1cccc(c1)S(C)(=O)=O)c1nccc(n1)C(F)(F)F
: