Target
Estrogen-related receptor gamma
Ligand
BDBM50193253
Substrate
Meas. Tech.
ChEMBL_1615017 (CHEMBL3857086)
IC50
20±n/a nM
Citation
 Kim, JChin, JIm, CYYoo, EKWoo, SHwang, HJCho, JHSeo, KASong, JHwang, HKim, KHKim, NDYoon, SKJeon, JHYoon, SYJeon, YHChoi, HSLee, IKKim, SHCho, SJ Synthesis and biological evaluation of novel 4-hydroxytamoxifen analogs as estrogen-related receptor gamma inverse agonists. Eur J Med Chem 120:338-52 (2016)  
Target
Name:
Estrogen-related receptor gamma
Synonyms:
ERR gamma-2 ERR3_HUMAN ESRRG Estrogen-Related Receptor, gamma KIAA0832 Nuclear receptor subfamily 3 group B member 3
Type:
PROTEIN
Mol. Mass.:
51305.00
Organism:
Homo sapiens (Human)
Description:
ChEMBL_1501351
Residue:
458
  
Inhibitor
Name:
BDBM50193253
Synonyms:
CHEMBL3961676
Type:
Small organic molecule
Emp. Form.:
C27H31ClFNO2
Mol. Mass.:
455.992
SMILES:
Cl.CN(C)CCOc1ccc(cc1)C(=C(\CCCF)c1ccccc1)\c1ccc(O)cc1
: