Target
High affinity choline transporter 1
Ligand
BDBM50196411
Substrate
Meas. Tech.
ChEMBL_1618520 (CHEMBL3860689)
IC50
1840±n/a nM
Citation
 Bertron, JLEnnis, EATarr, CJWright, JDickerson, JWLocuson, CWBlobaum, ALRook, JMBlakely, RDLindsley, CW Optimization of the choline transporter (CHT) inhibitor ML352: Development of VU6001221, an improved in vivo tool compound. Bioorg Med Chem Lett 26:4637-4640 (2016)  
Target
Name:
High affinity choline transporter 1
Synonyms:
CHT1 SC5A7_HUMAN high affinity choline transporter 1
Type:
PROTEIN
Mol. Mass.:
63194.33
Organism:
Homo sapiens (Human)
Description:
ChEMBL_1464247
Residue:
580
  
Inhibitor
Name:
BDBM50196411
Synonyms:
CHEMBL3923550
Type:
Small organic molecule
Emp. Form.:
C22H31N3O3
Mol. Mass.:
385.4998
SMILES:
CC(C)N1CCC(CC1)Oc1cccc(c1)C(=O)NCc1cc(no1)C(C)C
: