Target
High affinity choline transporter 1
Ligand
BDBM50196414
Substrate
Meas. Tech.
ChEMBL_1618520 (CHEMBL3860689)
IC50
640±n/a nM
Citation
 Bertron, JLEnnis, EATarr, CJWright, JDickerson, JWLocuson, CWBlobaum, ALRook, JMBlakely, RDLindsley, CW Optimization of the choline transporter (CHT) inhibitor ML352: Development of VU6001221, an improved in vivo tool compound. Bioorg Med Chem Lett 26:4637-4640 (2016)  
Target
Name:
High affinity choline transporter 1
Synonyms:
CHT1 SC5A7_HUMAN high affinity choline transporter 1
Type:
PROTEIN
Mol. Mass.:
63194.33
Organism:
Homo sapiens (Human)
Description:
ChEMBL_1464247
Residue:
580
  
Inhibitor
Name:
BDBM50196414
Synonyms:
CHEMBL3959257
Type:
Small organic molecule
Emp. Form.:
C20H27N3O3
Mol. Mass.:
357.4467
SMILES:
CC(C)c1cc(CNC(=O)c2cccc(OC3CCN(C)CC3)c2)on1
: