Target
Outer membrane protein MIP
Ligand
BDBM50200288
Substrate
Meas. Tech.
ChEMBL_1622004 (CHEMBL3864356)
IC50
7762±n/a nM
Citation
 Seufert, FKuhn, MHein, MWeiwad, MVivoli, MNorville, IHSarkar-Tyson, MMarshall, LESchweimer, KBruhn, HRösch, PHarmer, NJSotriffer, CAHolzgrabe, U Development, synthesis and structure-activity-relationships of inhibitors of the macrophage infectivity potentiator (Mip) proteins of Legionella pneumophila and Burkholderia pseudomallei. Bioorg Med Chem 24:5134-5147 (2016)  
Target
Name:
Outer membrane protein MIP
Synonyms:
MIP_LEGPN PPIase Rotamase | mip
Type:
PROTEIN
Mol. Mass.:
24869.94
Organism:
Legionella pneumophila
Description:
ChEMBL_701873
Residue:
233
  
Inhibitor
Name:
BDBM50200288
Synonyms:
CHEMBL3921322
Type:
Small organic molecule
Emp. Form.:
C20H24N2O5S
Mol. Mass.:
404.48
SMILES:
O=C(OCCOc1cccnc1)[C@@H]1CCCCN1S(=O)(=O)Cc1ccccc1
: