Target
Outer membrane protein MIP
Ligand
BDBM50200338
Substrate
Meas. Tech.
ChEMBL_1622004 (CHEMBL3864356)
IC50
5623±n/a nM
Citation
 Seufert, FKuhn, MHein, MWeiwad, MVivoli, MNorville, IHSarkar-Tyson, MMarshall, LESchweimer, KBruhn, HRösch, PHarmer, NJSotriffer, CAHolzgrabe, U Development, synthesis and structure-activity-relationships of inhibitors of the macrophage infectivity potentiator (Mip) proteins of Legionella pneumophila and Burkholderia pseudomallei. Bioorg Med Chem 24:5134-5147 (2016)  
Target
Name:
Outer membrane protein MIP
Synonyms:
MIP_LEGPN PPIase Rotamase | mip
Type:
PROTEIN
Mol. Mass.:
24869.94
Organism:
Legionella pneumophila
Description:
ChEMBL_701873
Residue:
233
  
Inhibitor
Name:
BDBM50200338
Synonyms:
CHEMBL3970282
Type:
Small organic molecule
Emp. Form.:
C28H38N2O9S
Mol. Mass.:
578.674
SMILES:
COCCOc1cc(OCCOC)cc(c1)C(=O)NCCOC(=O)[C@@H]1CCCCN1S(=O)(=O)Cc1ccccc1
: