Target
Retinoic acid receptor gamma
Ligand
BDBM50203490
Substrate
Meas. Tech.
ChEMBL_1625735 (CHEMBL3868204)
IC50
4100±n/a nM
Citation
 Ouvry, GBouix-Peter, CCiesielski, FChantalat, LChristin, OComino, CDuvert, DFeret, CHarris, CSLamy, LLuzy, APMusicki, BOrfila, DPascau, JParnet, VPerrin, APierre, RPolge, GRaffin, CRival, YTaquet, NThoreau, EHennequin, LF Discovery of phenoxyindazoles and phenylthioindazoles as ROR¿ inverse agonists. Bioorg Med Chem Lett 26:5802-5808 (2016)  
Target
Name:
Retinoic acid receptor gamma
Synonyms:
NR1B3 RAR-gamma RARG_HUMAN Retinoic acid receptor gamma | Retinoid receptor
Type:
PROTEIN
Mol. Mass.:
50345.43
Organism:
Homo sapiens (Human)
Description:
ChEMBL_1458016
Residue:
454
  
Inhibitor
Name:
BDBM50203490
Synonyms:
CHEMBL3905660
Type:
Small organic molecule
Emp. Form.:
C24H17Cl2N3O3S
Mol. Mass.:
498.381
SMILES:
OC(=O)c1ccc(cc1)-n1nc(Sc2c(Cl)cccc2Cl)c2cc(ccc12)C(=O)N1CCC1
: