Target
Nuclear receptor ROR-gamma
Ligand
BDBM50203490
Substrate
Meas. Tech.
ChEMBL_1625734 (CHEMBL3868203)
IC50
1200±n/a nM
Citation
 Ouvry, GBouix-Peter, CCiesielski, FChantalat, LChristin, OComino, CDuvert, DFeret, CHarris, CSLamy, LLuzy, APMusicki, BOrfila, DPascau, JParnet, VPerrin, APierre, RPolge, GRaffin, CRival, YTaquet, NThoreau, EHennequin, LF Discovery of phenoxyindazoles and phenylthioindazoles as ROR¿ inverse agonists. Bioorg Med Chem Lett 26:5802-5808 (2016)  
Target
Name:
Nuclear receptor ROR-gamma
Synonyms:
NR1F3 Nuclear receptor ROR-gamma (RORC) RAR-related orphan receptor C (RORc) RORG RZRG Retinoid-related orphan receptor-gamma (RORc)
Type:
Enzyme Catalytic Domain
Mol. Mass.:
58218.40
Organism:
Homo sapiens (Human)
Description:
P51449
Residue:
518
  
Inhibitor
Name:
BDBM50203490
Synonyms:
CHEMBL3905660
Type:
Small organic molecule
Emp. Form.:
C24H17Cl2N3O3S
Mol. Mass.:
498.381
SMILES:
OC(=O)c1ccc(cc1)-n1nc(Sc2c(Cl)cccc2Cl)c2cc(ccc12)C(=O)N1CCC1
: