Target
Free fatty acid receptor 1
Ligand
BDBM50203658
Substrate
Meas. Tech.
ChEMBL_1625793 (CHEMBL3868262)
EC50
5406±n/a nM
Citation
 Lombardo, MBender, KLondon, CPlotkin, MAKirkland, MMane, JPachanski, MGeissler, WCummings, JHabulihaz, BAkiyama, TEDi Salvo, JMadeira, MPols, JPowles, MAFinley, MFJohnson, ERoussel, TUebele, VNCrespo, ALeung, DAlleyne, CTrusca, DLei, YHoward, ADUjjainwalla, FTata, JRSinz, CJ Discovery of benzofuran propanoic acid GPR120 agonists: From uHTS hit to mechanism-based pharmacodynamic effects. Bioorg Med Chem Lett 26:5724-5728 (2016)  
Target
Name:
Free fatty acid receptor 1
Synonyms:
FFAR1 G-protein Coupled Receptor 40 | GPR40
Type:
G Protein-Coupled Receptor (GPCR)
Mol. Mass.:
31473.32
Organism:
Homo sapiens (Human)
Description:
O14842
Residue:
300
  
Inhibitor
Name:
BDBM50203658
Synonyms:
CHEMBL3973101
Type:
Small organic molecule
Emp. Form.:
C17H12F6O4
Mol. Mass.:
394.2652
SMILES:
OC(=O)CCCOc1c(F)cc(cc1F)-c1cc(OC(F)(F)F)ccc1F
: