Target
Free fatty acid receptor 1
Ligand
BDBM50203659
Substrate
Meas. Tech.
ChEMBL_1625793 (CHEMBL3868262)
EC50
2504±n/a nM
Citation
 Lombardo, MBender, KLondon, CPlotkin, MAKirkland, MMane, JPachanski, MGeissler, WCummings, JHabulihaz, BAkiyama, TEDi Salvo, JMadeira, MPols, JPowles, MAFinley, MFJohnson, ERoussel, TUebele, VNCrespo, ALeung, DAlleyne, CTrusca, DLei, YHoward, ADUjjainwalla, FTata, JRSinz, CJ Discovery of benzofuran propanoic acid GPR120 agonists: From uHTS hit to mechanism-based pharmacodynamic effects. Bioorg Med Chem Lett 26:5724-5728 (2016)  
Target
Name:
Free fatty acid receptor 1
Synonyms:
FFAR1 G-protein Coupled Receptor 40 | GPR40
Type:
G Protein-Coupled Receptor (GPCR)
Mol. Mass.:
31473.32
Organism:
Homo sapiens (Human)
Description:
O14842
Residue:
300
  
Inhibitor
Name:
BDBM50203659
Synonyms:
CHEMBL3968537
Type:
Small organic molecule
Emp. Form.:
C21H20O4
Mol. Mass.:
336.3811
SMILES:
OC(=O)CCc1cc2cc(ccc2o1)-c1cccc(OC2CCC2)c1
: