Target
Free fatty acid receptor 4
Ligand
BDBM50203671
Substrate
Meas. Tech.
ChEMBL_1625791 (CHEMBL3868260)
EC50
28±n/a nM
Citation
 Lombardo, MBender, KLondon, CPlotkin, MAKirkland, MMane, JPachanski, MGeissler, WCummings, JHabulihaz, BAkiyama, TEDi Salvo, JMadeira, MPols, JPowles, MAFinley, MFJohnson, ERoussel, TUebele, VNCrespo, ALeung, DAlleyne, CTrusca, DLei, YHoward, ADUjjainwalla, FTata, JRSinz, CJ Discovery of benzofuran propanoic acid GPR120 agonists: From uHTS hit to mechanism-based pharmacodynamic effects. Bioorg Med Chem Lett 26:5724-5728 (2016)  
Target
Name:
Free fatty acid receptor 4
Synonyms:
FFAR4_MOUSE Free fatty acid receptor 4 Gpr120 Omega-3 fatty acid receptor 1
Type:
PROTEIN
Mol. Mass.:
40828.60
Organism:
Mus musculus
Description:
ChEMBL_1454435
Residue:
361
  
Inhibitor
Name:
BDBM50203671
Synonyms:
CHEMBL3920591
Type:
Small organic molecule
Emp. Form.:
C22H22O4
Mol. Mass.:
350.4077
SMILES:
Cc1cc(OC2CCC2)cc(c1)-c1ccc2oc(CCC(O)=O)cc2c1
: